Uploaded image for project: 'ROOT'
  1. ROOT
  2. ROOT-10603

ROOT 6.19.02 and newer build fails on RHEL6

    XMLWordPrintable

    Details

    • Type: Bug
    • Status: Resolved (View Workflow)
    • Priority: High
    • Resolution: Clarified
    • Affects Version/s: 6.20/00
    • Fix Version/s: None
    • Component/s: Build System
    • Labels:
      None
    • Environment:

      RHEL 6
      GCC 8.1.0 or 6.3.0
      Processors nahalem, westmere

    • Development:

      Description

      The compilation fails during a build step for zstd. There is no way to disable the builtin zstd to work around this.

      Building C object builtins/zstd/CMakeFiles/zstd.dir/huf_compress.c.o
      {standard input}: Assembler messages:
      {standard input}:271: Error: no such instruction: `shlx %r13,%rax,%rax'
      {standard input}:274: Error: no such instruction: `shlx %rcx,%r13,%rcx'
      {standard input}:277: Error: no such instruction: `shlx %r12,%rcx,%r12'
      {standard input}:280: Error: no such instruction: `shlx %rdx,%rcx,%rcx'
      {standard input}:295: Error: no such instruction: `shrx %rdx,%rax,%rsi'
      {standard input}:360: Error: no such instruction: `shlx %r9,%rsi,%rsi'
      {standard input}:368: Error: no such instruction: `shrx %rax,%rsi,%rsi'
      {standard input}:383: Error: no such instruction: `shlx %r9,%rcx,%rsi'
      make[2]: *** [builtins/zstd/CMakeFiles/zstd.dir/huf_compress.c.o] Error 1
      make[1]: *** [builtins/zstd/CMakeFiles/zstd.dir/all] Error 2
      make: *** [all] Error 2
      

        Attachments

          Activity

            People

            Assignee:
            oshadura Oksana Shadura
            Reporter:
            613f2a276cdeb745102f Karl Smith
            Votes:
            0 Vote for this issue
            Watchers:
            3 Start watching this issue

              Dates

              Created:
              Updated:
              Resolved: