Uploaded image for project: 'ROOT'
  1. ROOT
  2. ROOT-10919

macOS 10.15.5 / root-v6.22.00 : build fails

    XMLWordPrintable

    Details

    • Type: Bug
    • Status: Open (View Workflow)
    • Priority: Medium
    • Resolution: Unresolved
    • Affects Version/s: 6.22/00
    • Fix Version/s: None
    • Component/s: Build System
    • Labels:
      None
    • Environment:

      macOS 10.15.5
      macport installed
      Xcode 11.5 (11E608c)

    • Development:

      Description

      A build for the following configuration fails:

      cmake ../ -Dgminimal=1 -Dasimage=1 -Dmathmore=1 -Dminuit2=1 -Dxml=1

      Error message:

      [ 97%] Building CXX object graf2d/cocoa/CMakeFiles/GCocoa.dir/src/TGCocoa.mm.o
      /Users/suter_a/Applications/root/graf2d/cocoa/src/TGCocoa.mm:20:10: fatal error: 'TGLIncludes.h' file not found
      #include "TGLIncludes.h"
      ^~~~~~~~~~~~~~~
      1 error generated.
      gmake[2]: *** [graf2d/cocoa/CMakeFiles/GCocoa.dir/build.make:200: graf2d/cocoa/CMakeFiles/GCocoa.dir/src/TGCocoa.mm.o] Fehler 1
      gmake[1]: *** [CMakeFiles/Makefile2:22040: graf2d/cocoa/CMakeFiles/GCocoa.dir/all] Fehler 2
      gmake: *** [Makefile:172: all] Fehler 2

        Attachments

          Activity

            People

            Assignee:
            oshadura Oksana Shadura
            Reporter:
            b150eb16a3d451ec0669 andreas.suter@psi.ch
            Votes:
            0 Vote for this issue
            Watchers:
            3 Start watching this issue

              Dates

              Created:
              Updated: