Uploaded image for project: 'ROOT'
  1. ROOT
  2. ROOT-8426

fedora 24 error :: TThreadExecutor.hxx:12:2: error: unterminated conditional directive

    XMLWordPrintable

    Details

    • Type: Bug
    • Status: Closed (View Workflow)
    • Priority: High
    • Resolution: Fixed
    • Affects Version/s: 6.08/00
    • Fix Version/s: 6.08/00
    • Component/s: Core Libraries
    • Labels:
      None
    • Environment:

      fedora 24 x86_64

    • Development:

      Description

      Hi! Trying to compile 29a23f3 (HEAD -> v6-08-00-patches, origin/v6-08-00-patches)
      i got this error :
      [ 53%] Generating G__Thread.cxx, ../../lib/libThread.rootmap
      In file included from input_line_9:27:
      /home/physics-tools/root/BUILD_ROOT/include/ROOT/TThreadExecutor.hxx:12:2: error: unterminated conditional directive
      #ifndef ROOT_TThreadExecutor
      ^
      Error: ../../bin/rootcling_tmp: compilation failure (/home/physics-tools/root/BUILD_ROOT/lib/libThread383abc4bf0_dictUmbrella.h)
      core/thread/CMakeFiles/G_Thread.dir/build.make:95: recipe for target 'core/thread/G_Thread.cxx' failed
      make[2]: *** [core/thread/G__Thread.cxx] Error 1
      CMakeFiles/Makefile2:11537: recipe for target 'core/thread/CMakeFiles/G__Thread.dir/all' failed
      make[1]: *** [core/thread/CMakeFiles/G__Thread.dir/all] Error 2
      Makefile:149: recipe for target 'all' failed
      make: *** [all] Error 2

      Is this known?
      Thank you!
      Adrian

        Attachments

          Activity

            People

            Assignee:
            mato Pere Mato Vila
            Reporter:
            asevcenc Adrian Sevcenco
            Votes:
            0 Vote for this issue
            Watchers:
            2 Start watching this issue

              Dates

              Created:
              Updated:
              Resolved:
              Actual End: