Uploaded image for project: 'ROOT'
  1. ROOT
  2. ROOT-9362

Problems while installing

    XMLWordPrintable

    Details

    • Development:

      Description

      While installing root, when I am running the make command at 100% level the terminal is showing
      collect2: error: ld returned 1 exit status
      roofit/histfactory/CMakeFiles/hist2workspace.dir/build.make:139: recipe for target 'bin/hist2workspace' failed
      make[2]: *** [bin/hist2workspace] Error 1
      CMakeFiles/Makefile2:28670: recipe for target 'roofit/histfactory/CMakeFiles/hist2workspace.dir/all' failed
      make[1]: *** [roofit/histfactory/CMakeFiles/hist2workspace.dir/all] Error 2
      make[1]: *** Waiting for unfinished jobs....
      [100%] Built target hsimple
      Makefile:149: recipe for target 'all' failed
      make: *** [all] Error 2

      What should I do to fix this problem?

        Attachments

          Activity

            People

            • Assignee:
              amadio Guilherme Amadio
              Reporter:
              4c2279f77d52b2ebfff9 Sayan Saha (Inactive)
            • Votes:
              0 Vote for this issue
              Watchers:
              2 Start watching this issue

              Dates

              • Created:
                Updated:
                Resolved: